Reaction Details
TargetCytochrome P450 2B1
LigandBDBM50404853
Substrate/Competitorn/a
Meas. Tech.ChEMBL_35522 (CHEMBL644755)
IC50 53000±n/a nM
Citation Little, PJRyan, AJ Inhibitors of hepatic mixed-function oxidases. 4. Effects of benzimidazole and related compounds on aryl hydrocarbon hydroxylase activity from phenobarbitone and 3-methylcholanthrene induced rats. J Med Chem25:622-6 (1982) Cytochrome P450 2B1
Name:Cytochrome P450 2B1
Type:PROTEIN
Mol. Mass.:55940.51
Organism:Rattus norvegicus
Description:ChEMBL_774167
Residue:491
BDBM50404853
NameBDBM50404853
Synonyms:CHEMBL156313
TypeSmall organic molecule
Emp. Form.C11H8N2
Mol. Mass.168.1946
SMILESc1nc2cc3ccccc3cc2[nH]1