Reaction Details
TargetCytochrome P450 2B1
LigandBDBM50404886
Substrate/Competitorn/a
Meas. Tech.ChEMBL_35524 (CHEMBL644757)
IC50 10964.78±n/a nM
Citation Murray, MRyan, AJLittle, PJ Inhibition of rat hepatic microsomal aminopyrine N-demethylase activity by benzimidazole derivatives. Quantitative structure-activity relationships. J Med Chem25:887-92 (1982) Cytochrome P450 2B1
Name:Cytochrome P450 2B1
Type:PROTEIN
Mol. Mass.:55940.51
Organism:Rattus norvegicus
Description:ChEMBL_774167
Residue:491
BDBM50404886
NameBDBM50404886
Synonyms:CHEMBL169709
TypeSmall organic molecule
Emp. Form.C14H10Br2N2O
Mol. Mass.382.05
SMILESBrc1ccc(OCc2nc3ccccc3[nH]2)c(Br)c1