Reaction Details
TargetCytochrome P450 2B1
LigandBDBM50404888
Substrate/Competitorn/a
Meas. Tech.ChEMBL_35524 (CHEMBL644757)
IC50 15135.61±n/a nM
Citation Murray, MRyan, AJLittle, PJ Inhibition of rat hepatic microsomal aminopyrine N-demethylase activity by benzimidazole derivatives. Quantitative structure-activity relationships. J Med Chem25:887-92 (1982) Cytochrome P450 2B1
Name:Cytochrome P450 2B1
Type:PROTEIN
Mol. Mass.:55940.51
Organism:Rattus norvegicus
Description:ChEMBL_774167
Residue:491
BDBM50404888
NameBDBM50404888
Synonyms:CHEMBL169203
TypeSmall organic molecule
Emp. Form.C17H18N2
Mol. Mass.250.3382
SMILESC(CCc1ccccc1)Cc1nc2ccccc2[nH]1