Reaction Details
TargetCytochrome P450 2B1
LigandBDBM50404891
Substrate/Competitorn/a
Meas. Tech.ChEMBL_35524 (CHEMBL644757)
IC50 30200±n/a nM
Citation Murray, MRyan, AJLittle, PJ Inhibition of rat hepatic microsomal aminopyrine N-demethylase activity by benzimidazole derivatives. Quantitative structure-activity relationships. J Med Chem25:887-92 (1982) Cytochrome P450 2B1
Name:Cytochrome P450 2B1
Type:PROTEIN
Mol. Mass.:55940.51
Organism:Rattus norvegicus
Description:ChEMBL_774167
Residue:491
BDBM50404891
NameBDBM50404891
Synonyms:CHEMBL353945
TypeSmall organic molecule
Emp. Form.C16H15ClN2O
Mol. Mass.286.756
SMILESCc1cc(OCc2nc3ccccc3[nH]2)cc(C)c1Cl