Reaction Details
TargetCytochrome P450 2B1
LigandBDBM50404902
Substrate/Competitorn/a
Meas. Tech.ChEMBL_35524 (CHEMBL644757)
IC50 18197.01±n/a nM
Citation Murray, MRyan, AJLittle, PJ Inhibition of rat hepatic microsomal aminopyrine N-demethylase activity by benzimidazole derivatives. Quantitative structure-activity relationships. J Med Chem25:887-92 (1982) Cytochrome P450 2B1
Name:Cytochrome P450 2B1
Type:PROTEIN
Mol. Mass.:55940.51
Organism:Rattus norvegicus
Description:ChEMBL_774167
Residue:491
BDBM50404902
NameBDBM50404902
Synonyms:CHEMBL355669
TypeSmall organic molecule
Emp. Form.C18H14N2
Mol. Mass.258.3172
SMILESC(c1nc2ccccc2[nH]1)c1ccc2ccccc2c1