Reaction Details
TargetCytochrome P450 2B1
LigandBDBM50404904
Substrate/Competitorn/a
Meas. Tech.ChEMBL_35524 (CHEMBL644757)
IC50 41686.94±n/a nM
Citation Murray, MRyan, AJLittle, PJ Inhibition of rat hepatic microsomal aminopyrine N-demethylase activity by benzimidazole derivatives. Quantitative structure-activity relationships. J Med Chem25:887-92 (1982) Cytochrome P450 2B1
Name:Cytochrome P450 2B1
Type:PROTEIN
Mol. Mass.:55940.51
Organism:Rattus norvegicus
Description:ChEMBL_774167
Residue:491
BDBM50404904
NameBDBM50404904
Synonyms:CHEMBL170910
TypeSmall organic molecule
Emp. Form.C15H22N2
Mol. Mass.230.3486
SMILESCCCCCCCc1nc2ccc(C)cc2[nH]1