Reaction Details
TargetCytochrome P450 2B1
LigandBDBM50404907
Substrate/Competitorn/a
Meas. Tech.ChEMBL_35524 (CHEMBL644757)
IC50 26915.35±n/a nM
Citation Murray, MRyan, AJLittle, PJ Inhibition of rat hepatic microsomal aminopyrine N-demethylase activity by benzimidazole derivatives. Quantitative structure-activity relationships. J Med Chem25:887-92 (1982) Cytochrome P450 2B1
Name:Cytochrome P450 2B1
Type:PROTEIN
Mol. Mass.:55940.51
Organism:Rattus norvegicus
Description:ChEMBL_774167
Residue:491
BDBM50404907
NameBDBM50404907
Synonyms:CHEMBL172114
TypeSmall organic molecule
Emp. Form.C14H10ClN3O
Mol. Mass.271.702
SMILESClc1cc(NC(=O)c2ccccc2)c2[nH]cnc2c1