Reaction Details
TargetAdenosine receptor A2b
LigandBDBM50026636
Substrate/Competitorn/a
Meas. Tech.ChEMBL_32934 (CHEMBL646076)
Kd 13.8±n/a nM
Citation Chapleo, CBMyers, PLButler, RCDoxey, JCRoach, AGSmith, CF alpha-adrenoreceptor reagents. 1. Synthesis of some 1,4-benzodioxans as selective presynaptic alpha 2-adrenoreceptor antagonists and potential antidepressants. J Med Chem26:823-31 (1983) Adenosine receptor A2b
Name:Adenosine receptor A2b
Type:PROTEIN
Mol. Mass.:36378.84
Organism:Rattus norvegicus
Description:ChEMBL_32934
Residue:332
BDBM50026636
NameBDBM50026636
Synonyms:17alpha-hydroxy-20alpha-yohimban-16beta-carboxylic acid methyl ester RAUWOLSCINE HYDROCHLORIDE corynanthidine mesoyohimbine methyl 17alpha-hydroxy-20alpha-yohimban-16beta-carboxylate | rauwolscine
TypeSmall organic molecule
Emp. Form.C21H26N2O3
Mol. Mass.354.4427
SMILESCOC(=O)[C@@H]1[C@@H](O)CC[C@@H]2CN3CCc4c([nH]c5ccccc45)[C@@H]3C[C@H]12