Reaction Details
Target2-Hydroxyacid oxidase 1
LigandBDBM50405005
Substrate/Competitorn/a
Meas. Tech.ChEMBL_71275 (CHEMBL685164)
IC50 1400±n/a nM
Citation Williams, HWEichler, ERandall, WCRooney, CSCragoe, EJStreeter, KBSchwam, HMichelson, SRPatchett, AATaub, D Inhibitors of glycolic acid oxidase. 4-substituted 2,4-dioxobutanoic acid derivatives. J Med Chem26:1196-200 (1983) 2-Hydroxyacid oxidase 1
Name:2-Hydroxyacid oxidase 1
Type:PROTEIN
Mol. Mass.:40927.89
Organism:Homo sapiens (Human)
Description:ChEMBL_71275
Residue:370
BDBM50405005
NameBDBM50405005
Synonyms:CHEMBL279530
TypeSmall organic molecule
Emp. Form.C15H20O4
Mol. Mass.264.3169
SMILESCC1=C(C=CC(=O)CC(=O)C(O)=O)C(C)(C)CCC1