Reaction Details
Target2-Hydroxyacid oxidase 1
LigandBDBM50405009
Substrate/Competitorn/a
Meas. Tech.ChEMBL_71275 (CHEMBL685164)
IC50 2100±n/a nM
Citation Williams, HWEichler, ERandall, WCRooney, CSCragoe, EJStreeter, KBSchwam, HMichelson, SRPatchett, AATaub, D Inhibitors of glycolic acid oxidase. 4-substituted 2,4-dioxobutanoic acid derivatives. J Med Chem26:1196-200 (1983) 2-Hydroxyacid oxidase 1
Name:2-Hydroxyacid oxidase 1
Type:PROTEIN
Mol. Mass.:40927.89
Organism:Homo sapiens (Human)
Description:ChEMBL_71275
Residue:370
BDBM50405009
NameBDBM50405009
Synonyms:CHEMBL19028
TypeSmall organic molecule
Emp. Form.C20H18O4
Mol. Mass.322.3545
SMILESOC(=O)C(=O)CC(=O)c1ccc(cc1)C1CCCc2ccccc12