Reaction Details
TargetDihydrofolate reductase
LigandBDBM50405065
Substrate/Competitorn/a
Meas. Tech.ChEMBL_53616 (CHEMBL661845)
Ki 20±n/a nM
Citation Hansch, CHathaway, BAGuo, ZRSelassie, CDDietrich, SWBlaney, JMLangridge, RVolz, KWKaufman, BT Crystallography, quantitative structure-activity relationships, and molecular graphics in a comparative analysis of the inhibition of dihydrofolate reductase from chicken liver and Lactobacillus casei by 4,6-diamino-1,2-dihydro-2,2-dimethyl-1-(substituted-phenyl)-s-triazine s. J Med Chem27:129-43 (1984) Dihydrofolate reductase
Name:Dihydrofolate reductase
Type:n/a
Mol. Mass.:21652.69
Organism:Gallus gallus (Chicken)
Description:n/a
Residue:189
BDBM50405065
NameBDBM50405065
Synonyms:CHEMBL286571
TypeSmall organic molecule
Emp. Form.C19H23N5S
Mol. Mass.353.484
SMILESCc1cccc(SCc2cccc(c2)N2C(N)=NC(N)=NC2(C)C)c1