Reaction Details
TargetDihydrofolate reductase
LigandBDBM50405085
Substrate/Competitorn/a
Meas. Tech.ChEMBL_53616 (CHEMBL661845)
Ki 63±n/a nM
Citation Hansch, CHathaway, BAGuo, ZRSelassie, CDDietrich, SWBlaney, JMLangridge, RVolz, KWKaufman, BT Crystallography, quantitative structure-activity relationships, and molecular graphics in a comparative analysis of the inhibition of dihydrofolate reductase from chicken liver and Lactobacillus casei by 4,6-diamino-1,2-dihydro-2,2-dimethyl-1-(substituted-phenyl)-s-triazine s. J Med Chem27:129-43 (1984) Dihydrofolate reductase
Name:Dihydrofolate reductase
Type:n/a
Mol. Mass.:21652.69
Organism:Gallus gallus (Chicken)
Description:n/a
Residue:189
BDBM50405085
NameBDBM50405085
Synonyms:CHEMBL6771
TypeSmall organic molecule
Emp. Form.C21H27N5O2
Mol. Mass.381.4714
SMILESCC1(C)N=C(N)N=C(N)N1c1cccc(OCCCCOc2ccccc2)c1