Reaction Details
TargetDihydrofolate reductase
LigandBDBM50291782
Substrate/Competitorn/a
Meas. Tech.ChEBML_53616
Ki 26±n/a nM
Citation Hansch, CHathaway, BAGuo, ZRSelassie, CDDietrich, SWBlaney, JMLangridge, RVolz, KWKaufman, BT Crystallography, quantitative structure-activity relationships, and molecular graphics in a comparative analysis of the inhibition of dihydrofolate reductase from chicken liver and Lactobacillus casei by 4,6-diamino-1,2-dihydro-2,2-dimethyl-1-(substituted-phenyl)-s-triazine s. J Med Chem27:129-43 (1984) Dihydrofolate reductase
Name:Dihydrofolate reductase
Type:n/a
Mol. Mass.:21652.69
Organism:Gallus gallus (Chicken)
Description:n/a
Residue:189
BDBM50291782
NameBDBM50291782
Synonyms:3-[3-(4,6-Diamino-2,2-dimethyl-2H-[1,3,5]triazin-1-yl)-benzyloxy]-benzonitrile | CHEMBL283740
TypeSmall organic molecule
Emp. Form.C19H20N6O
Mol. Mass.348.4017
SMILESCC1(C)N=C(N)N=C(N)N1c1cccc(COc2cccc(c2)C#N)c1