Reaction Details
TargetDNA topoisomerase 3
LigandBDBM50028349
Substrate/Competitorn/a
Meas. Tech.ChEMBL_54525 (CHEMBL858266)
Ki 3999±n/a nM
Citation Wright, GEGambino, JJ Quantitative structure-activity relationships of 6-anilinouracils as inhibitors of Bacillus subtilis DNA polymerase III. J Med Chem27:181-5 (1984) DNA topoisomerase 3
Name:DNA topoisomerase 3
Type:PROTEIN
Mol. Mass.:81515.22
Organism:Bacillus subtilis
Description:ChEMBL_54525
Residue:727
BDBM50028349
NameBDBM50028349
Synonyms:6-(4-Bromo-phenylamino)-1H-pyrimidine-2,4-dione | CHEMBL293964
TypeSmall organic molecule
Emp. Form.C10H8BrN3O2
Mol. Mass.282.093
SMILESBrc1ccc(Nc2cc(=O)[nH]c(=O)[nH]2)cc1