Reaction Details
TargetDNA topoisomerase 3
LigandBDBM50028350
Substrate/Competitorn/a
Meas. Tech.ChEMBL_54524 (CHEMBL663871)
Ki 920±n/a nM
Citation Wright, GEGambino, JJ Quantitative structure-activity relationships of 6-anilinouracils as inhibitors of Bacillus subtilis DNA polymerase III. J Med Chem27:181-5 (1984) DNA topoisomerase 3
Name:DNA topoisomerase 3
Type:PROTEIN
Mol. Mass.:81515.22
Organism:Bacillus subtilis
Description:ChEMBL_54525
Residue:727
BDBM50028350
NameBDBM50028350
Synonyms:6-(3,4-Dimethyl-phenylamino)-1H-pyrimidine-2,4-dione | CHEMBL54782
TypeSmall organic molecule
Emp. Form.C12H13N3O2
Mol. Mass.231.2505
SMILESCc1ccc(Nc2cc(=O)[nH]c(=O)[nH]2)cc1C