Reaction Details
TargetNeutrophil elastase
LigandBDBM50405203
Substrate/Competitorn/a
Meas. Tech.ChEBML_63630
Ki 93325±n/a nM
Citation Spencer, RWCopp, LJPfister, JR Inhibition of human leukocyte elastase, porcine pancreatic elastase, and chymotrypsin by elasnin and other 4-hydroxy-2-pyrones. J Med Chem28:1828-32 (1986) Neutrophil elastase
Name:Neutrophil elastase
Type:Enzyme
Mol. Mass.:28532.38
Organism:Homo sapiens (Human)
Description:P08246
Residue:267
BDBM50405203
NameBDBM50405203
Synonyms:CHEMBL54524
TypeSmall organic molecule
Emp. Form.C24H40O4
Mol. Mass.392.572
SMILESCCCCCC(=O)C(CCCC)c1oc(=O)c(CCCC)c(O)c1CCCC