Reaction Details
TargetChymotrypsin-C
LigandBDBM50405206
Substrate/Competitorn/a
Meas. Tech.ChEBML_49611
Ki 512861±n/a nM
Citation Spencer, RWCopp, LJPfister, JR Inhibition of human leukocyte elastase, porcine pancreatic elastase, and chymotrypsin by elasnin and other 4-hydroxy-2-pyrones. J Med Chem28:1828-32 (1986) Chymotrypsin-C
Name:Chymotrypsin-C
Type:Enzyme
Mol. Mass.:29487.98
Organism:Homo sapiens (Human)
Description:Q99895
Residue:268
BDBM50405206
NameBDBM50405206
Synonyms:CHEMBL298353
TypeSmall organic molecule
Emp. Form.C14H12O4
Mol. Mass.244.2427
SMILESCc1c(O)cc(CC(=O)c2ccccc2)oc1=O