Reaction Details
TargetChymotrypsin-like elastase family member 1
LigandBDBM50405207
Substrate/Competitorn/a
Meas. Tech.ChEBML_153468
Ki 15136±n/a nM
Citation Spencer, RWCopp, LJPfister, JR Inhibition of human leukocyte elastase, porcine pancreatic elastase, and chymotrypsin by elasnin and other 4-hydroxy-2-pyrones. J Med Chem28:1828-32 (1986) Chymotrypsin-like elastase family member 1
Name:Chymotrypsin-like elastase family member 1
Type:Enzyme
Mol. Mass.:28827.71
Organism:Sus scrofa (Pig)
Description:P00772
Residue:266
BDBM50405207
NameBDBM50405207
Synonyms:CHEMBL53936
TypeSmall organic molecule
Emp. Form.C25H42O4
Mol. Mass.406.5986
SMILESCCCCCCC(CCCC)(C=O)c1oc(=O)c(CCCC)c(O)c1CCCC