Reaction Details
TargetAromatase
LigandBDBM50011767
Substrate/Competitorn/a
Meas. Tech.ChEMBL_51040 (CHEMBL662252)
Ki 20±n/a nM
Citation Rowlands, MGBunnett, MAFoster, ABJarman, MStanek, JSchweizer, E Analogues of aminoglutethimide based on 1-phenyl-3-azabicyclo[3.1.0]hexane-2,4-dione: selective inhibition of aromatase activity. J Med Chem31:971-6 (1988) Aromatase
Name:Aromatase
Type:Enzyme
Mol. Mass.:57888.92
Organism:Homo sapiens (Human)
Description:P11511
Residue:503
BDBM50011767
NameBDBM50011767
Synonyms:1-(4-Amino-phenyl)-3-pentyl-3-aza-bicyclo[3.1.0]hexane-2,4-dione | CHEMBL26651
TypeSmall organic molecule
Emp. Form.C16H20N2O2
Mol. Mass.272.3422
SMILESCCCCCN1C(=O)C2CC2(C1=O)c1ccc(N)cc1