Reaction Details
TargetGlutamate receptor ionotropic, NMDA 2C
LigandBDBM83449
Substrate/Competitorn/a
Meas. Tech.ChEMBL_154851 (CHEMBL857518)
Ki 91±n/a nM
Citation de Costa, BRGeorge, CBurke, TRRafferty, MFContreras, PCMick, SJJacobson, AERice, KC Synthesis, configuration, and evaluation of two conformationally restrained analogues of phencyclidine. J Med Chem31:1571-5 (1988) Glutamate receptor ionotropic, NMDA 2C
Name:Glutamate receptor ionotropic, NMDA 2C
Type:Protein
Mol. Mass.:135305.94
Organism:Rattus norvegicus (Rat)
Description:Q00961
Residue:1237
BDBM83449
NameBDBM83449
Synonyms:1-(1-phenylcyclohexyl)piperidine;hydrochloride PCP PHENCYCLIDINE SMR001338811 | cid_9795678
TypeSmall organic molecule
Emp. Form.C17H25N
Mol. Mass.243.3871
SMILESC1CCN(CC1)C1(CCCCC1)c1ccccc1