Reaction Details
TargetThymidylate synthase
LigandBDBM50405731
Substrate/Competitorn/a
Meas. Tech.ChEBML_209789
Ki 0.072000±n/a nM
Citation Pawelczak, KJones, TRKempny, MJackman, ALNewell, DRKrzyzanowski, LRzeszotarska, B Quinazoline antifolates inhibiting thymidylate synthase: synthesis of four oligo(L-gamma-glutamyl) conjugates of N10-propargyl-5,8-dideazafolic acid and their enzyme inhibition. J Med Chem32:160-5 (1989) Thymidylate synthase
Name:Thymidylate synthase
Type:Enzyme
Mol. Mass.:35718.07
Organism:Homo sapiens (Human)
Description:n/a
Residue:313
BDBM50405731
NameBDBM50405731
Synonyms:CHEMBL295708
TypeSmall organic molecule
Emp. Form.C34H37N7O12
Mol. Mass.735.6973
SMILESNc1nc2ccc(CN(CC#C)c3ccc(cc3)C(=O)NC(CCC(=O)NC(CCC(=O)NC(CCC(O)=O)C(O)=O)C(O)=O)C(O)=O)cc2c(=O)[nH]1