Reaction Details
TargetLutropin-choriogonadotropic hormone receptor
LigandBDBM50405785
Substrate/Competitorn/a
Meas. Tech.ChEMBL_100146 (CHEMBL712503)
Ki 2.6±n/a nM
Citation Haviv, FPalabrica, CABush, ENDiaz, GJohnson, ESLove, SGreer, J Active reduced-size hexapeptide analogues of luteinizing hormone-releasing hormone. J Med Chem32:2340-4 (1989) Lutropin-choriogonadotropic hormone receptor
Name:Lutropin-choriogonadotropic hormone receptor
Type:PROTEIN
Mol. Mass.:78049.26
Organism:Rattus norvegicus
Description:ChEMBL_97289
Residue:700
BDBM50405785
NameBDBM50405785
Synonyms:CHEMBL275709
TypeSmall organic molecule
Emp. Form.C56H70N10O9
Mol. Mass.1027.2166
SMILESCCNC(=O)C1CCCN1C(=O)[C@H](CCCNC(N)=N)NC(=O)[C@H](CC(C)C)NC(=O)[C@@H](Cc1ccc2ccccc2c1)NC(=O)[C@H](Cc1ccc(O)cc1)NC(=O)[C@H](CO)NC(=O)Cc1cccc2ccccc12