Reaction Details
TargetLutropin-choriogonadotropic hormone receptor
LigandBDBM50422274
Substrate/Competitorn/a
Meas. Tech.ChEMBL_100146 (CHEMBL712503)
Ki 1.3±n/a nM
Citation Haviv, FPalabrica, CABush, ENDiaz, GJohnson, ESLove, SGreer, J Active reduced-size hexapeptide analogues of luteinizing hormone-releasing hormone. J Med Chem32:2340-4 (1989) Lutropin-choriogonadotropic hormone receptor
Name:Lutropin-choriogonadotropic hormone receptor
Type:PROTEIN
Mol. Mass.:78049.26
Organism:Rattus norvegicus
Description:ChEMBL_97289
Residue:700
BDBM50422274
NameBDBM50422274
Synonyms:GONADORELIN | Human gonadoliberin-i
TypeSmall organic molecule
Emp. Form.C55H75N17O13
Mol. Mass.1182.2901
SMILESCC(C)C[C@H](NC(=O)CNC(=O)[C@H](Cc1ccc(O)cc1)NC(=O)[C@H](CO)NC(=O)[C@H](Cc1c[nH]c2ccccc12)NC(=O)[C@H](Cc1cnc[nH]1)NC(=O)[C@@H]1CCC(=O)N1)C(=O)N[C@@H](CCCNC(N)=N)C(=O)N1CCC[C@H]1C(=O)NCC(N)=O