Reaction Details
TargetDihydrofolate reductase
LigandBDBM50029760
Substrate/Competitorn/a
Meas. Tech.ChEBML_53614
Ki 229087±n/a nM
Citation Selassie, CDFang, ZXLi, RLHansch, CDebnath, GKlein, TELangridge, RKaufman, BT On the structure selectivity problem in drug design. A comparative study of benzylpyrimidine inhibition of vertebrate and bacterial dihydrofolate reductase via molecular graphics and quantitative structure-activity relationships. J Med Chem32:1895-905 (1989) Dihydrofolate reductase
Name:Dihydrofolate reductase
Type:n/a
Mol. Mass.:21652.69
Organism:Gallus gallus (Chicken)
Description:n/a
Residue:189
BDBM50029760
NameBDBM50029760
Synonyms:5-[3,5-Dimethoxy-4-(2-methoxy-ethoxy)-benzyl]-pyrimidine-2,4-diamine CHEMBL32039 | Tetroxoprim
TypeSmall organic molecule
Emp. Form.C16H22N4O4
Mol. Mass.334.3703
SMILESCOCCOc1c(OC)cc(Cc2cnc(N)nc2N)cc1OC