Reaction Details
TargetNeutrophil elastase
LigandBDBM50406239
Substrate/Competitorn/a
Meas. Tech.ChEMBL_21101 (CHEMBL633695)
Ki 2.512E-1±n/a nM
KOFF 7.079E-5 s-1
KON 3.09E5 M-1s-1
Citation Krantz, ASpencer, RWTam, TFLiak, TJCopp, LJThomas, EMRafferty, SP Design and synthesis of 4H-3,1-benzoxazin-4-ones as potent alternate substrate inhibitors of human leukocyte elastase. J Med Chem33:464-79 (1990) Neutrophil elastase
Name:Neutrophil elastase
Type:Enzyme
Mol. Mass.:28532.38
Organism:Homo sapiens (Human)
Description:P08246
Residue:267
BDBM50406239
NameBDBM50406239
Synonyms:CHEMBL357464
TypeSmall organic molecule
Emp. Form.C13H15NO3
Mol. Mass.233.2631
SMILESCCCc1cccc2nc(OCC)oc(=O)c12