Reaction Details
TargetNeutrophil elastase
LigandBDBM50406303
Substrate/Competitorn/a
Meas. Tech.ChEMBL_21101 (CHEMBL633695)
Ki 3.981E2±n/a nM
KOFF 2.399E-5 s-1
KON 6.607E1 M-1s-1
Citation Krantz, ASpencer, RWTam, TFLiak, TJCopp, LJThomas, EMRafferty, SP Design and synthesis of 4H-3,1-benzoxazin-4-ones as potent alternate substrate inhibitors of human leukocyte elastase. J Med Chem33:464-79 (1990) Neutrophil elastase
Name:Neutrophil elastase
Type:Enzyme
Mol. Mass.:28532.38
Organism:Homo sapiens (Human)
Description:P08246
Residue:267
BDBM50406303
NameBDBM50406303
Synonyms:CHEMBL145690
TypeSmall organic molecule
Emp. Form.C17H24N2O2
Mol. Mass.288.3847
SMILESCCCCN(CCCC)c1nc2cccc(C)c2c(=O)o1