Reaction Details
TargetNeutrophil elastase
LigandBDBM50406260
Substrate/Competitorn/a
Meas. Tech.ChEMBL_21101 (CHEMBL633695)
Ki 1.41±n/a nM
KOFF 3.548E-4 s-1
KON 2.512E5 M-1s-1
Citation Krantz, ASpencer, RWTam, TFLiak, TJCopp, LJThomas, EMRafferty, SP Design and synthesis of 4H-3,1-benzoxazin-4-ones as potent alternate substrate inhibitors of human leukocyte elastase. J Med Chem33:464-79 (1990) Neutrophil elastase
Name:Neutrophil elastase
Type:Enzyme
Mol. Mass.:28532.38
Organism:Homo sapiens (Human)
Description:P08246
Residue:267
BDBM50406260
NameBDBM50406260
Synonyms:CHEMBL143793
TypeSmall organic molecule
Emp. Form.C10H9NO2S
Mol. Mass.207.249
SMILESCSc1nc2cccc(C)c2c(=O)o1