Reaction Details
TargetNeutrophil elastase
LigandBDBM50291760
Substrate/Competitorn/a
Meas. Tech.ChEMBL_21101 (CHEMBL633695)
Ki 1E0±n/a nM
KOFF 6.607E-5 s-1
KON 7.079E4 M-1s-1
Citation Krantz, ASpencer, RWTam, TFLiak, TJCopp, LJThomas, EMRafferty, SP Design and synthesis of 4H-3,1-benzoxazin-4-ones as potent alternate substrate inhibitors of human leukocyte elastase. J Med Chem33:464-79 (1990) Neutrophil elastase
Name:Neutrophil elastase
Type:Enzyme
Mol. Mass.:28532.38
Organism:Homo sapiens (Human)
Description:P08246
Residue:267
BDBM50291760
NameBDBM50291760
Synonyms:5-Ethyl-2-isopropylamino-benzo[d][1,3]oxazin-4-one | CHEMBL145550
TypeSmall organic molecule
Emp. Form.C13H16N2O2
Mol. Mass.232.2783
SMILESCCc1cccc2nc(NC(C)C)oc(=O)c12