Reaction Details
TargetNeutrophil elastase
LigandBDBM50406293
Substrate/Competitorn/a
Meas. Tech.ChEMBL_21101 (CHEMBL633695)
Ki 0.071±n/a nM
KOFF 5.495E-5 s-1
KON 7.762E5 M-1s-1
Citation Krantz, ASpencer, RWTam, TFLiak, TJCopp, LJThomas, EMRafferty, SP Design and synthesis of 4H-3,1-benzoxazin-4-ones as potent alternate substrate inhibitors of human leukocyte elastase. J Med Chem33:464-79 (1990) Neutrophil elastase
Name:Neutrophil elastase
Type:Enzyme
Mol. Mass.:28532.38
Organism:Homo sapiens (Human)
Description:P08246
Residue:267
BDBM50406293
NameBDBM50406293
Synonyms:CHEMBL356120
TypeSmall organic molecule
Emp. Form.C13H15NO3
Mol. Mass.233.2631
SMILESCCOc1nc2cccc(C(C)C)c2c(=O)o1