Reaction Details
TargetNeutrophil elastase
LigandBDBM50449417
Substrate/Competitorn/a
Meas. Tech.ChEMBL_21101 (CHEMBL633695)
Ki 1E1±n/a nM
Citation Krantz, ASpencer, RWTam, TFLiak, TJCopp, LJThomas, EMRafferty, SP Design and synthesis of 4H-3,1-benzoxazin-4-ones as potent alternate substrate inhibitors of human leukocyte elastase. J Med Chem33:464-79 (1990) Neutrophil elastase
Name:Neutrophil elastase
Type:Enzyme
Mol. Mass.:28532.38
Organism:Homo sapiens (Human)
Description:P08246
Residue:267
BDBM50449417
NameBDBM50449417
Synonyms:CHEMBL356307
TypeSmall organic molecule
Emp. Form.C14H16N2O3
Mol. Mass.260.2884
SMILESCCCCN(C(C)=O)c1nc2ccccc2c(=O)o1