Reaction Details
TargetNeutrophil elastase
LigandBDBM50406266
Substrate/Competitorn/a
Meas. Tech.ChEMBL_21101 (CHEMBL633695)
Ki 7.943E0±n/a nM
KOFF 2.239E-2 s-1
KON 2.884E6 M-1s-1
Citation Krantz, ASpencer, RWTam, TFLiak, TJCopp, LJThomas, EMRafferty, SP Design and synthesis of 4H-3,1-benzoxazin-4-ones as potent alternate substrate inhibitors of human leukocyte elastase. J Med Chem33:464-79 (1990) Neutrophil elastase
Name:Neutrophil elastase
Type:Enzyme
Mol. Mass.:28532.38
Organism:Homo sapiens (Human)
Description:P08246
Residue:267
BDBM50406266
NameBDBM50406266
Synonyms:CHEMBL358112
TypeSmall organic molecule
Emp. Form.C11H11NO2S
Mol. Mass.221.276
SMILESCC(C)Sc1nc2ccccc2c(=O)o1