Reaction Details
TargetProstaglandin G/H synthase 1/2
LigandBDBM50012434
Substrate/Competitorn/a
Meas. Tech.ChEMBL_177028 (CHEMBL781696)
IC50>300000±n/a nM
Citation Bruneau, PDelvare, CEdwards, MPMcMillan, RM Indazolinones, a new series of redox-active 5-lipoxygenase inhibitors with built-in selectivity and oral activity. J Med Chem34:1028-36 (1991) Prostaglandin G/H synthase 1/2
Name:Prostaglandin G/H synthase 1/2
Synonyms:Cyclooxygenase
Type:n/a
Mol. Mass.:n/a
Description:ASSAY_ID of ChEMBL is 1666355
Components:This complex has 2 components.
Component 1
Name:Prostaglandin G/H synthase 2
Type:Enzyme Catalytic Domain
Mol. Mass.:69173.51
Organism:RAT
Description:COX-2 0 RAT::P35355
Residue:604
Component 2
Name:Prostaglandin G/H synthase 1
Synonyms:Cox-1 Cyclooxygenase PGH1_RAT Ptgs1
Type:Enzyme Catalytic Domain
Mol. Mass.:69033.56
Organism:RAT
Description:COX-1 0 RAT::Q63921
Residue:602
BDBM50012434
NameBDBM50012434
Synonyms:(REV-5,901)1-[3-(Quinolin-2-ylmethoxy)-phenyl]-hexan-1-ol 1-[3-(Quinolin-2-ylmethoxy)-phenyl]-hexan-1-ol (RG 5901) CHEMBL8747 REV-901
TypeSmall organic molecule
Emp. Form.C22H25NO2
Mol. Mass.335.4394
SMILESCCCCCC(O)c1cccc(OCc2ccc3ccccc3n2)c1