Reaction Details
TargetPolyunsaturated fatty acid 5-lipoxygenase
LigandBDBM50009001
Substrate/Competitorn/a
Meas. Tech.ChEMBL_98489 (CHEMBL879813)
EC50>370000±n/a nM
Citation Bruneau, PDelvare, CEdwards, MPMcMillan, RM Indazolinones, a new series of redox-active 5-lipoxygenase inhibitors with built-in selectivity and oral activity. J Med Chem34:1028-36 (1991) Polyunsaturated fatty acid 5-lipoxygenase
Name:Polyunsaturated fatty acid 5-lipoxygenase
Type:Enzyme
Mol. Mass.:77972.74
Organism:Homo sapiens (Human)
Description:Recombinant protein was purified from E. coli lysate. After ammonium sulfate precipitation and subsequent steps, the supernatant (S100) was used for 5-LO activity assay.
Residue:674
BDBM50009001
NameBDBM50009001
Synonyms:5,6,7-Trihydroxyflavone Baicalein Baicalein, 8 US10252984, Table 2.33
TypeSmall organic molecule
Emp. Form.C15H10O5
Mol. Mass.270.2369
SMILESOc1cc2oc(cc(=O)c2c(O)c1O)-c1ccccc1