Reaction Details
TargetAdenosine receptor A2a/A2b
LigandBDBM50406511
Substrate/Competitorn/a
Meas. Tech.ChEMBL_27634 (CHEMBL639510)
EC50 1.6±n/a nM
Citation Ueeda, MThompson, RDArroyo, LHOlsson, RA 2-aralkoxyadenosines: potent and selective agonists at the coronary artery A2 adenosine receptor. J Med Chem34:1340-4 (1991) Adenosine receptor A2a/A2b
Name:Adenosine receptor A2a/A2b
Synonyms:Adenosine A2 receptor
Type:n/a
Mol. Mass.:n/a
Description:ASSAY_ID of ChEMBL is 329906
Components:This complex has 2 components.
Component 1
Name:Adenosine receptor A2b
Type:G Protein-Coupled Receptor (GPCR)
Mol. Mass.:36341.22
Organism:Homo sapiens (Human)
Description:n/a
Residue:332
Component 2
Name:Adenosine receptor A2a
Synonyms:A2A adenosine receptor (hA2A) ADENOSINE A2 ADORA2 Adenosine A2A receptor (A2AAR)
Type:G Protein-Coupled Receptor (GPCR)
Mol. Mass.:44716.46
Organism:Homo sapiens (Human)
Description:P29274
Residue:412
BDBM50406511
NameBDBM50406511
Synonyms:CHEMBL604836
TypeSmall organic molecule
Emp. Form.C19H23N5O5
Mol. Mass.401.4164
SMILESCc1cccc(CCOc2nc(N)c3ncn(C4O[C@@H](CO)[C@H](O)[C@@H]4O)c3n2)c1