Reaction Details
TargetAdenosine receptor A2a/A2b
LigandBDBM50406520
Substrate/Competitorn/a
Meas. Tech.ChEMBL_27633 (CHEMBL639509)
EC50 9.8±n/a nM
Citation Ueeda, MThompson, RDArroyo, LHOlsson, RA 2-aralkoxyadenosines: potent and selective agonists at the coronary artery A2 adenosine receptor. J Med Chem34:1340-4 (1991) Adenosine receptor A2a/A2b
Name:Adenosine receptor A2a/A2b
Synonyms:Adenosine A2 receptor
Type:n/a
Mol. Mass.:n/a
Description:ASSAY_ID of ChEMBL is 329906
Components:This complex has 2 components.
Component 1
Name:Adenosine receptor A2b
Type:G Protein-Coupled Receptor (GPCR)
Mol. Mass.:36341.22
Organism:Homo sapiens (Human)
Description:n/a
Residue:332
Component 2
Name:Adenosine receptor A2a
Synonyms:A2A adenosine receptor (hA2A) ADENOSINE A2 ADORA2 Adenosine A2A receptor (A2AAR)
Type:G Protein-Coupled Receptor (GPCR)
Mol. Mass.:44716.46
Organism:Homo sapiens (Human)
Description:P29274
Residue:412
BDBM50406520
NameBDBM50406520
Synonyms:CHEMBL605256
TypeSmall organic molecule
Emp. Form.C20H22N6O5
Mol. Mass.426.4259
SMILESNc1nc(OCCc2c[nH]c3ccccc23)nc2n(cnc12)C1O[C@@H](CO)[C@H](O)[C@@H]1O