Reaction Details
Target7-dehydrocholesterol reductase
LigandBDBM50406617
Substrate/Competitorn/a
Meas. Tech.ChEBML_53601
Ki 7±n/a nM
Citation Ator, MASchmidt, SJAdams, JLDolle, REKruse, LIFrey, CLBarone, JM Synthesis, specificity, and antifungal activity of inhibitors of the Candida albicans delta 24-sterol methyltransferase. J Med Chem35:100-6 (1992) 7-dehydrocholesterol reductase
Name:7-dehydrocholesterol reductase
Type:PROTEIN
Mol. Mass.:54168.97
Organism:Rattus norvegicus
Description:ChEMBL_53595
Residue:471
BDBM50406617
NameBDBM50406617
Synonyms:CHEMBL276388
TypeSmall organic molecule
Emp. Form.C27H46N2O
Mol. Mass.414.6669
SMILESC[C@H](CCC(N)=N)C1CC[C@@]2(C)C3=C(CC[C@]12C)[C@@]1(C)CC[C@H](O)C(C)(C)C1CC3