Reaction Details
Target7-dehydrocholesterol reductase
LigandBDBM50406621
Substrate/Competitorn/a
Meas. Tech.ChEBML_53601
Ki 4±n/a nM
Citation Ator, MASchmidt, SJAdams, JLDolle, REKruse, LIFrey, CLBarone, JM Synthesis, specificity, and antifungal activity of inhibitors of the Candida albicans delta 24-sterol methyltransferase. J Med Chem35:100-6 (1992) 7-dehydrocholesterol reductase
Name:7-dehydrocholesterol reductase
Type:PROTEIN
Mol. Mass.:54168.97
Organism:Rattus norvegicus
Description:ChEMBL_53595
Residue:471
BDBM50406621
NameBDBM50406621
Synonyms:CHEMBL9820
TypeSmall organic molecule
Emp. Form.C27H47OS
Mol. Mass.419.726
SMILESC[C@H](CC[S+](C)C(C)C)C1CCC2C3CC=C4C[C@@H](O)CC[C@]4(C)C3CC[C@]12C