Reaction Details
TargetThymidylate synthase
LigandBDBM50406711
Substrate/Competitorn/a
Meas. Tech.ChEBML_209982
Ki 3.7±n/a nM
Citation Bisset, GMPawelczak, KJackman, ALCalvert, AHHughes, LR Syntheses and thymidylate synthase inhibitory activity of the poly-gamma-glutamyl conjugates of N-[5-[N-(3,4-dihydro-2-methyl-4-oxoquinazolin-6-ylmethyl)-N-methylamino ]-2-thenoyl]-L-glutamic acid (ICI D1694) and other quinazoline antifolates. J Med Chem35:859-66 (1992) Thymidylate synthase
Name:Thymidylate synthase
Type:PROTEIN
Mol. Mass.:34957.15
Organism:Mus musculus
Description:ChEMBL_1340097
Residue:307
BDBM50406711
NameBDBM50406711
Synonyms:CHEMBL405513
TypeSmall organic molecule
Emp. Form.C46H57N9O21S
Mol. Mass.1104.057
SMILESCN(Cc1ccc2nc(C)[nH]c(=O)c2c1)c1ccc(s1)C(=O)N[C@@H](CCC(=O)N[C@@H](CCC(=O)N[C@@H](CCC(=O)N[C@@H](CCC(=O)N[C@@H](CCC(=O)N[C@@H](CCC(O)=O)C(O)=O)C(O)=O)C(O)=O)C(O)=O)C(O)=O)C(O)=O