Reaction Details
Target5-hydroxytryptamine receptor 1D
LigandBDBM50406765
Substrate/Competitorn/a
Meas. Tech.ChEBML_1965
IC50 10±n/a nM
Citation Street, LJBaker, RCastro, JLChambers, MSGuiblin, ARHobbs, SCMatassa, VGReeve, AJBeer, MSMiddlemiss, DN Synthesis and serotonergic activity of 5-(oxadiazolyl)tryptamines: potent agonists for 5-HT1D receptors. J Med Chem36:1529-38 (1993) 5-hydroxytryptamine receptor 1D
Name:5-hydroxytryptamine receptor 1D
Type:PROTEIN
Mol. Mass.:32680.56
Organism:Sus scrofa
Description:ChEMBL_1963
Residue:291
BDBM50406765
NameBDBM50406765
Synonyms:CHEMBL39111
TypeSmall organic molecule
Emp. Form.C14H17N5O
Mol. Mass.271.3177
SMILESNCCc1c[nH]c2ccc(CCc3nc(N)no3)cc12