Reaction Details
Target5-hydroxytryptamine receptor 1A
LigandBDBM50406773
Substrate/Competitorn/a
Meas. Tech.ChEBML_1080
IC50 50±n/a nM
Citation Street, LJBaker, RCastro, JLChambers, MSGuiblin, ARHobbs, SCMatassa, VGReeve, AJBeer, MSMiddlemiss, DN Synthesis and serotonergic activity of 5-(oxadiazolyl)tryptamines: potent agonists for 5-HT1D receptors. J Med Chem36:1529-38 (1993) 5-hydroxytryptamine receptor 1A
Name:5-hydroxytryptamine receptor 1A
Type:n/a
Mol. Mass.:46122.49
Organism:Homo sapiens (Human)
Description:n/a
Residue:422
BDBM50406773
NameBDBM50406773
Synonyms:CHEMBL290587
TypeSmall organic molecule
Emp. Form.C16H21N5O
Mol. Mass.299.3708
SMILESCN(C)CCc1c[nH]c2ccc(CCc3nc(N)no3)cc12