Reaction Details
Target5-hydroxytryptamine receptor 1D
LigandBDBM50406770
Substrate/Competitorn/a
Meas. Tech.ChEBML_1965
IC50 32±n/a nM
Citation Street, LJBaker, RCastro, JLChambers, MSGuiblin, ARHobbs, SCMatassa, VGReeve, AJBeer, MSMiddlemiss, DN Synthesis and serotonergic activity of 5-(oxadiazolyl)tryptamines: potent agonists for 5-HT1D receptors. J Med Chem36:1529-38 (1993) 5-hydroxytryptamine receptor 1D
Name:5-hydroxytryptamine receptor 1D
Type:PROTEIN
Mol. Mass.:32680.56
Organism:Sus scrofa
Description:ChEMBL_1963
Residue:291
BDBM50406770
NameBDBM50406770
Synonyms:CHEMBL39712
TypeSmall organic molecule
Emp. Form.C14H16N4O
Mol. Mass.256.303
SMILESCc1noc(Cc2ccc3[nH]cc(CCN)c3c2)n1