Reaction Details
Target5-hydroxytryptamine receptor 2C
LigandBDBM50406773
Substrate/Competitorn/a
Meas. Tech.ChEBML_1850
IC50 1000±n/a nM
Citation Street, LJBaker, RCastro, JLChambers, MSGuiblin, ARHobbs, SCMatassa, VGReeve, AJBeer, MSMiddlemiss, DN Synthesis and serotonergic activity of 5-(oxadiazolyl)tryptamines: potent agonists for 5-HT1D receptors. J Med Chem36:1529-38 (1993) 5-hydroxytryptamine receptor 2C
Name:5-hydroxytryptamine receptor 2C
Type:G Protein-Coupled Receptor (GPCR)
Mol. Mass.:51836.79
Organism:Homo sapiens (Human)
Description:P28335
Residue:458
BDBM50406773
NameBDBM50406773
Synonyms:CHEMBL290587
TypeSmall organic molecule
Emp. Form.C16H21N5O
Mol. Mass.299.3708
SMILESCN(C)CCc1c[nH]c2ccc(CCc3nc(N)no3)cc12