Reaction Details
TargetAngiotensin-converting enzyme
LigandBDBM50406369
Substrate/Competitorn/a
Meas. Tech.ChEBML_36150
IC50 0.524807±n/a nM
Citation Waller, CLMarshall, GR Three-dimensional quantitative structure-activity relationship of angiotesin-converting enzyme and thermolysin inhibitors. II. A comparison of CoMFA models incorporating molecular orbital fields and desolvation free energies based on active-analog and complementary-receptor-field alignment rules. J Med Chem36:2390-403 (1993) Angiotensin-converting enzyme
Name:Angiotensin-converting enzyme
Type:Enzyme
Mol. Mass.:149709.01
Organism:Homo sapiens (Human)
Description:n/a
Residue:1306
BDBM50406369
NameBDBM50406369
Synonyms:CHEMBL289022
TypeSmall organic molecule
Emp. Form.C22H35N2O6PS
Mol. Mass.486.562
SMILESCS[C@@H]1C[C@H](N(C1)C(=O)[C@H](CCCCN)OP(O)(=O)CCCCc1ccccc1)C(O)=O