Reaction Details
TargetAngiotensin-converting enzyme
LigandBDBM50406384
Substrate/Competitorn/a
Meas. Tech.ChEBML_36150
IC50 0.630957±n/a nM
Citation Waller, CLMarshall, GR Three-dimensional quantitative structure-activity relationship of angiotesin-converting enzyme and thermolysin inhibitors. II. A comparison of CoMFA models incorporating molecular orbital fields and desolvation free energies based on active-analog and complementary-receptor-field alignment rules. J Med Chem36:2390-403 (1993) Angiotensin-converting enzyme
Name:Angiotensin-converting enzyme
Type:Enzyme
Mol. Mass.:149709.01
Organism:Homo sapiens (Human)
Description:n/a
Residue:1306
BDBM50406384
NameBDBM50406384
Synonyms:CHEMBL34650
TypeSmall organic molecule
Emp. Form.C23H35N2O6PS2
Mol. Mass.530.638
SMILESNCCCC[C@H](OP(O)(=O)CCCCc1ccccc1)C(=O)N1CC2(C[C@H]1C(O)=O)SCCS2