Reaction Details
TargetGag-Pol polyprotein [489-587]
LigandBDBM519
Substrate/Competitorn/a
Meas. Tech.ChEMBL_158033 (CHEMBL768257)
IC50 0.400000±n/a nM
Citation Waller, CLOprea, TIGiolitti, AMarshall, GR Three-dimensional QSAR of human immunodeficiency virus (I) protease inhibitors. 1. A CoMFA study employing experimentally-determined alignment rules. J Med Chem36:4152-60 (1994) Gag-Pol polyprotein [489-587]
Name:Gag-Pol polyprotein [489-587]
Type:Enzyme Subunit
Mol. Mass.:10781.16
Organism:Human immunodeficiency virus type 1
Description:P04585[489-587]
Residue:99
BDBM519
NameBDBM519
Synonyms:(2S)-N-[(2S,3R)-4-[(3S,4aS,8aS)-3-(tert-butylcarbamoyl)-decahydroisoquinolin-2-yl]-3-hydroxy-1-phenylbutan-2-yl]-2-(quinolin-2-ylformamido)butanediamide Fortovase Ro 31-8959 Saquinavir
TypeSmall organic molecule
Emp. Form.C38H50N6O5
Mol. Mass.670.8408
SMILESCC(C)(C)NC(=O)[C@@H]1C[C@@H]2CCCC[C@@H]2CN1C[C@@H](O)[C@H](Cc1ccccc1)NC(=O)[C@H](CC(N)=O)NC(=O)c1ccc2ccccc2n1