Reaction Details
TargetReverse transcriptase/RNaseH
LigandBDBM2264
Substrate/Competitorn/a
Meas. Tech.ChEMBL_195671 (CHEMBL800744)
IC50 45000±n/a nM
Citation Hoffman, JMSmith, AMRooney, CSFisher, TEWai, JSThomas, CMBamberger, DLBarnes, JLWilliams, TMJones, JH Synthesis and evaluation of 2-pyridinone derivatives as HIV-1-specific reverse transcriptase inhibitors. 4. 3-[2-(Benzoxazol-2-yl)ethyl]-5-ethyl-6-methylpyridin-2(1H)-one and analogues. J Med Chem36:953-66 (1993) Reverse transcriptase/RNaseH
Name:Reverse transcriptase/RNaseH
Type:PROTEIN
Mol. Mass.:65229.15
Organism:Human immunodeficiency virus 1
Description:ChEMBL_1473730
Residue:566
BDBM2264
NameBDBM2264
Synonyms:2-Pyridinone derivative 44 3-[(Benzoxazol-2-yl)methyl]-5-ethyl-6-methylpyridin-2(1H)-one | CHEMBL367515
TypeSmall organic molecule
Emp. Form.C16H16N2O2
Mol. Mass.268.3104
SMILESCCc1cc(Cc2nc3ccccc3o2)c(=O)[nH]c1C