Reaction Details
TargetReverse transcriptase/RNaseH
LigandBDBM50407113
Substrate/Competitorn/a
Meas. Tech.ChEMBL_195671 (CHEMBL800744)
IC50>300000±n/a nM
Citation Hoffman, JMSmith, AMRooney, CSFisher, TEWai, JSThomas, CMBamberger, DLBarnes, JLWilliams, TMJones, JH Synthesis and evaluation of 2-pyridinone derivatives as HIV-1-specific reverse transcriptase inhibitors. 4. 3-[2-(Benzoxazol-2-yl)ethyl]-5-ethyl-6-methylpyridin-2(1H)-one and analogues. J Med Chem36:953-66 (1993) Reverse transcriptase/RNaseH
Name:Reverse transcriptase/RNaseH
Type:PROTEIN
Mol. Mass.:65229.15
Organism:Human immunodeficiency virus 1
Description:ChEMBL_1473730
Residue:566
BDBM50407113
NameBDBM50407113
Synonyms:CHEMBL173280
TypeSmall organic molecule
Emp. Form.C16H17Cl2N3O3
Mol. Mass.370.23
SMILESCCc1cc(NCC(=O)Nc2c(O)cc(Cl)cc2Cl)c(=O)[nH]c1C