Reaction Details
TargetReverse transcriptase/RNaseH
LigandBDBM1317
Substrate/Competitorn/a
Meas. Tech.ChEMBL_195671 (CHEMBL800744)
IC50 20±n/a nM
Citation Hoffman, JMSmith, AMRooney, CSFisher, TEWai, JSThomas, CMBamberger, DLBarnes, JLWilliams, TMJones, JH Synthesis and evaluation of 2-pyridinone derivatives as HIV-1-specific reverse transcriptase inhibitors. 4. 3-[2-(Benzoxazol-2-yl)ethyl]-5-ethyl-6-methylpyridin-2(1H)-one and analogues. J Med Chem36:953-66 (1993) Reverse transcriptase/RNaseH
Name:Reverse transcriptase/RNaseH
Type:PROTEIN
Mol. Mass.:65229.15
Organism:Human immunodeficiency virus 1
Description:ChEMBL_1473730
Residue:566
BDBM1317
NameBDBM1317
Synonyms:3-[[(4,7-Dichlorobenzoxazol-2-yl)-methyl]amino]-5-ethyl-6-methylpyridin-2(1H)-one CHEMBL268871 Pyridinone deriv.
TypeSmall organic molecule
Emp. Form.C16H15Cl2N3O2
Mol. Mass.352.215
SMILESCCc1cc(NCc2nc3c(Cl)ccc(Cl)c3o2)c(=O)[nH]c1C