Reaction Details
TargetReverse transcriptase/RNaseH
LigandBDBM2224
Substrate/Competitorn/a
Meas. Tech.ChEMBL_195671 (CHEMBL800744)
IC50 50000±n/a nM
Citation Hoffman, JMSmith, AMRooney, CSFisher, TEWai, JSThomas, CMBamberger, DLBarnes, JLWilliams, TMJones, JH Synthesis and evaluation of 2-pyridinone derivatives as HIV-1-specific reverse transcriptase inhibitors. 4. 3-[2-(Benzoxazol-2-yl)ethyl]-5-ethyl-6-methylpyridin-2(1H)-one and analogues. J Med Chem36:953-66 (1993) Reverse transcriptase/RNaseH
Name:Reverse transcriptase/RNaseH
Type:PROTEIN
Mol. Mass.:65229.15
Organism:Human immunodeficiency virus 1
Description:ChEMBL_1473730
Residue:566
BDBM2224
NameBDBM2224
Synonyms:2-Pyridinone derivative 4 5-ethyl-6-methyl-3-(2-phenylethyl)-1,2-dihydropyridin-2-one | CHEMBL353328
TypeSmall organic molecule
Emp. Form.C16H19NO
Mol. Mass.241.3282
SMILESCCc1cc(CCc2ccccc2)c(=O)[nH]c1C