Reaction Details
TargetReverse transcriptase/RNaseH
LigandBDBM50407259
Substrate/Competitorn/a
Meas. Tech.ChEMBL_43176 (CHEMBL659203)
EC50 280±n/a nM
Citation Kumar, RWang, LWiebe, LIKnaus, EE Synthesis, in vitro biological stability, and anti-HIV activity of 5-halo-6-alkoxy(or azido)-5,6-dihydro-3'-azido-3'-deoxythymidine diastereomers as potential prodrugs to 3'-azido-3'-deoxythymidine (AZT). J Med Chem37:4297-306 (1995) Reverse transcriptase/RNaseH
Name:Reverse transcriptase/RNaseH
Type:PROTEIN
Mol. Mass.:65229.15
Organism:Human immunodeficiency virus 1
Description:ChEMBL_1473730
Residue:566
BDBM50407259
NameBDBM50407259
Synonyms:CHEMBL342041
TypeSmall organic molecule
Emp. Form.C11H16BrN5O5
Mol. Mass.378.179
SMILESCO[C@@H]1N(C2CC(N=[N+]=[N-])C(CO)O2)C(=O)NC(=O)[C@@]1(C)Br